Target
Nuclear receptor ROR-gamma
Ligand
BDBM416499
Substrate
Meas. Tech.
Radio-Ligand Binding Assay
Ki
<100±n/a nM
Citation
 Claremon, DADillard, LWFan, YLotesta, SDSingh, SBTice, CMZhao, WZhuang, L Substituted benzoimidazoles as modulators of ROR-γ US Patent  US10829448 Publication Date 11/10/2020 
Target
Name:
Nuclear receptor ROR-gamma
Synonyms:
NR1F3 Nuclear receptor ROR-gamma (RORC) RAR-related orphan receptor C (RORc) RORG RZRG Retinoid-related orphan receptor-gamma (RORc)
Type:
Enzyme Catalytic Domain
Mol. Mass.:
58218.40
Organism:
Homo sapiens (Human)
Description:
P51449
Residue:
518
  
Inhibitor
Name:
BDBM416499
Synonyms:
US10301261, Compound BE-49 tert-butyl 4-((1-cyclopropyl-5-((4-(ethylsulfonyl)benzyl)carbamoyl)-1H-benzo[d]imidazol-2-yl)methyl)piperidine-1-carboxylate
Type:
Small organic molecule
Emp. Form.:
C31H40N4O5S
Mol. Mass.:
580.738
SMILES:
CCS(=O)(=O)c1ccc(CNC(=O)c2ccc3n(C4CC4)c(CC4CCN(CC4)C(=O)OC(C)(C)C)nc3c2)cc1
: