Target
Nuclear receptor ROR-gamma
Ligand
BDBM416518
Substrate
Meas. Tech.
Radio-Ligand Binding Assay
Ki
<100±n/a nM
Citation
 Claremon, DADillard, LWFan, YLotesta, SDSingh, SBTice, CMZhao, WZhuang, L Substituted benzoimidazoles as modulators of ROR-γ US Patent  US10829448 Publication Date 11/10/2020 
Target
Name:
Nuclear receptor ROR-gamma
Synonyms:
NR1F3 Nuclear receptor ROR-gamma (RORC) RAR-related orphan receptor C (RORc) RORG RZRG Retinoid-related orphan receptor-gamma (RORc)
Type:
Enzyme Catalytic Domain
Mol. Mass.:
58218.40
Organism:
Homo sapiens (Human)
Description:
P51449
Residue:
518
  
Inhibitor
Name:
BDBM416518
Synonyms:
(R)-1-cyclopropyl-N-(1-(4-(ethylsulfonyl)phenyl)-2-hydroxyethyl)-2-(4-(trifluoromethyl)benzoyl)-1H-benzo[d]imidazole-5-carboxamide US10829448, Compound BE-61
Type:
Small organic molecule
Emp. Form.:
C29H26F3N3O5S
Mol. Mass.:
585.594
SMILES:
CCS(=O)(=O)c1ccc(cc1)[C@H](CO)NC(=O)c1ccc2n(C3CC3)c(nc2c1)C(=O)c1ccc(cc1)C(F)(F)F
: