Target
Nuclear receptor ROR-gamma
Ligand
BDBM416531
Substrate
Meas. Tech.
Radio-Ligand Binding Assay
Ki
<100±n/a nM
Citation
 Claremon, DADillard, LWFan, YLotesta, SDSingh, SBTice, CMZhao, WZhuang, L Substituted benzoimidazoles as modulators of ROR-γ US Patent  US10829448 Publication Date 11/10/2020 
Target
Name:
Nuclear receptor ROR-gamma
Synonyms:
NR1F3 Nuclear receptor ROR-gamma (RORC) RAR-related orphan receptor C (RORc) RORG RZRG Retinoid-related orphan receptor-gamma (RORc)
Type:
Enzyme Catalytic Domain
Mol. Mass.:
58218.40
Organism:
Homo sapiens (Human)
Description:
P51449
Residue:
518
  
Inhibitor
Name:
BDBM416531
Synonyms:
3-cyclopropyl-N-(4-(ethylsulfonyl)benzyl)-2-(((1r,4r)-4-(trifluoromethyl)cyclohexyl)methyl)-3H-imidazo[4,5-b]pyridine-6-carboxamide US10829448, Compound AB-1.2
Type:
Small organic molecule
Emp. Form.:
C27H31F3N4O3S
Mol. Mass.:
548.62
SMILES:
CCS(=O)(=O)c1ccc(CNC(=O)c2cnc3n(C4CC4)c(C[C@H]4CC[C@@H](CC4)C(F)(F)F)nc3c2)cc1
: