Target
Nuclear receptor ROR-gamma
Ligand
BDBM472230
Substrate
Meas. Tech.
Binding Assay
Ki
<100±n/a nM
Citation
 Claremon, DADillard, LWFan, YLotesta, SDSingh, SBTice, CMZhao, WZhuang, L Benzimidazole derivatives as modulators of ROR-gamma US Patent  US10829481 Publication Date 11/10/2020 
Target
Name:
Nuclear receptor ROR-gamma
Synonyms:
NR1F3 Nuclear receptor ROR-gamma (RORC) RAR-related orphan receptor C (RORc) RORG RZRG Retinoid-related orphan receptor-gamma (RORc)
Type:
Enzyme Catalytic Domain
Mol. Mass.:
58218.40
Organism:
Homo sapiens (Human)
Description:
P51449
Residue:
518
  
Inhibitor
Name:
BDBM472230
Synonyms:
1-((2,2-difluorobenzo[d][1,3]dioxol-4-yl)methyl)-N-(4- | US10829481, Compound I-55
Type:
Small organic molecule
Emp. Form.:
C26H23F2N3O6S
Mol. Mass.:
543.539
SMILES:
CCS(=O)(=O)c1ccc(CNC(=O)c2ccc3n(Cc4cccc5OC(F)(F)Oc45)c(OC)nc3c2)cc1
: