Target
Nuclear receptor ROR-gamma
Ligand
BDBM472258
Substrate
Meas. Tech.
Binding Assay
Ki
<100±n/a nM
Citation
 Claremon, DADillard, LWFan, YLotesta, SDSingh, SBTice, CMZhao, WZhuang, L Benzimidazole derivatives as modulators of ROR-gamma US Patent  US10829481 Publication Date 11/10/2020 
Target
Name:
Nuclear receptor ROR-gamma
Synonyms:
NR1F3 Nuclear receptor ROR-gamma (RORC) RAR-related orphan receptor C (RORc) RORG RZRG Retinoid-related orphan receptor-gamma (RORc)
Type:
Enzyme Catalytic Domain
Mol. Mass.:
58218.40
Organism:
Homo sapiens (Human)
Description:
P51449
Residue:
518
  
Inhibitor
Name:
BDBM472258
Synonyms:
(R)-1-((2,3-dihydrobenzofuran-7-yl)methyl)-N-(1-(4- | US10829481, Compound I-80
Type:
Small organic molecule
Emp. Form.:
C28H26F3N3O5S
Mol. Mass.:
573.583
SMILES:
CCS(=O)(=O)c1ccc(cc1)[C@H](CO)NC(=O)c1ccc2n(Cc3cccc4CCOc34)c(nc2c1)C(F)(F)F
: