Target
Nuclear receptor ROR-gamma
Ligand
BDBM472279
Substrate
Meas. Tech.
Binding Assay
Ki
<100±n/a nM
Citation
 Claremon, DADillard, LWFan, YLotesta, SDSingh, SBTice, CMZhao, WZhuang, L Benzimidazole derivatives as modulators of ROR-gamma US Patent  US10829481 Publication Date 11/10/2020 
Target
Name:
Nuclear receptor ROR-gamma
Synonyms:
NR1F3 Nuclear receptor ROR-gamma (RORC) RAR-related orphan receptor C (RORc) RORG RZRG Retinoid-related orphan receptor-gamma (RORc)
Type:
Enzyme Catalytic Domain
Mol. Mass.:
58218.40
Organism:
Homo sapiens (Human)
Description:
P51449
Residue:
518
  
Inhibitor
Name:
BDBM472279
Synonyms:
1-((1H-indazol-4-yl)methyl)-N-(4-(ethylsulfonyl)benzyl)-2- | US10829481, Compound I-97
Type:
Small organic molecule
Emp. Form.:
C26H22F3N5O3S
Mol. Mass.:
541.545
SMILES:
CCS(=O)(=O)c1ccc(CNC(=O)c2ccc3n(Cc4cccc5[nH]ncc45)c(nc3c2)C(F)(F)F)cc1
: