Target
Nuclear receptor ROR-gamma
Ligand
BDBM472348
Substrate
Meas. Tech.
Binding Assay
Ki
550±n/a nM
Citation
 Claremon, DADillard, LWFan, YLotesta, SDSingh, SBTice, CMZhao, WZhuang, L Benzimidazole derivatives as modulators of ROR-gamma US Patent  US10829481 Publication Date 11/10/2020 
Target
Name:
Nuclear receptor ROR-gamma
Synonyms:
NR1F3 Nuclear receptor ROR-gamma (RORC) RAR-related orphan receptor C (RORc) RORG RZRG Retinoid-related orphan receptor-gamma (RORc)
Type:
Enzyme Catalytic Domain
Mol. Mass.:
58218.40
Organism:
Homo sapiens (Human)
Description:
P51449
Residue:
518
  
Inhibitor
Name:
BDBM472348
Synonyms:
N-(4-(ethylsulfonyl)benzyl)-1-((1-methyl-2-oxo-1,2-dihydropyridin-3- | US10829481, Compound I-146
Type:
Small organic molecule
Emp. Form.:
C25H23F3N4O4S
Mol. Mass.:
532.535
SMILES:
CCS(=O)(=O)c1ccc(CNC(=O)c2ccc3n(Cc4cccn(C)c4=O)c(nc3c2)C(F)(F)F)cc1
: