Target
Integrin alpha-V/beta-1
Ligand
BDBM472691
Substrate
Meas. Tech.
Cell adhesion assay to SW480
IC50
>10000±n/a nM
Citation
 Sheppard, DSundaram, ADegrado, WFJo, HMcIntosh, J Inhibitors of integrin alpha 5 beta 1 and methods of use US Patent  US10836720 Publication Date 11/17/2020 
Target
Name:
Integrin alpha-V/beta-1
Synonyms:
Fibronectin receptor beta/Vitronectin receptor alpha Integrin alpha-V/beta-1
Type:
Enzyme
Mol. Mass.:
Description:
Components:
This complex has 2 components.
Component 1
Name:
Integrin alpha-V
Synonyms:
ITAV_HUMAN Integrin alpha-V/alpha-5 VNRA Vitronectin receptor | Vitronectin receptor subunit alpha
Type:
PROTEIN
Mol. Mass.:
116024.92
Organism:
Homo sapiens (Human)
Description:
ChEMBL_582336
Residue:
1048
  
Component 2
Name:
Integrin beta-1
Synonyms:
CD_antigen=CD29 Fibronectin receptor beta GPIIA ITGB1 MDF2 | MSK12
Type:
Enzyme
Mol. Mass.:
88400.38
Organism:
Homo sapiens (Human)
Description:
P05556
Residue:
798
  
Inhibitor
Name:
BDBM472691
Synonyms:
US10836720, HIJ-1203
Type:
Small organic molecule
Emp. Form.:
C32H39N9O7S
Mol. Mass.:
693.773
SMILES:
OC(=O)[C@H](CNC(=O)CNC(=O)c1cccc(NC2=NCCN2C2=NCCN2)c1)NC(=O)C1C2CCC(CC2)N1S(=O)(=O)c1ccccc1
: