Target
Tyrosine-protein kinase SYK
Ligand
BDBM473072
Substrate
Meas. Tech.
Biochemical Assay
IC50
3800±n/a nM
Citation
 Blomgren, PACurrie, KSKropf, JELee, SHMitchell, SASchmitt, ACXu, JZhao, Z Imidazopyridines Syk inhibitors US Patent  US10842803 Publication Date 11/24/2020 
Target
Name:
Tyrosine-protein kinase SYK
Synonyms:
KSYK_HUMAN Spleen Tyrosine Kinase Tyrosine-protein kinase SYK (Syk)
Type:
Enzyme
Mol. Mass.:
72079.99
Organism:
Homo sapiens (Human)
Description:
P43405
Residue:
635
  
Inhibitor
Name:
BDBM473072
Synonyms:
N-[6-(1H-indazol-6- yl)imidazo[1,2- a]pyridin-8-yl]-5,6- dimethoxypyridin-2- amine | US10842803, Structure TABLE 1.2
Type:
Small organic molecule
Emp. Form.:
C21H18N6O2
Mol. Mass.:
386.4066
SMILES:
COc1ccc(Nc2cc(cn3ccnc23)-c2ccc3cn[nH]c3c2)nc1OC
: