Target
Tyrosine-protein kinase SYK
Ligand
BDBM473082
Substrate
Meas. Tech.
Biochemical Assay
IC50
6600±n/a nM
Citation
 Blomgren, PACurrie, KSKropf, JELee, SHMitchell, SASchmitt, ACXu, JZhao, Z Imidazopyridines Syk inhibitors US Patent  US10842803 Publication Date 11/24/2020 
Target
Name:
Tyrosine-protein kinase SYK
Synonyms:
KSYK_HUMAN Spleen Tyrosine Kinase Tyrosine-protein kinase SYK (Syk)
Type:
Enzyme
Mol. Mass.:
72079.99
Organism:
Homo sapiens (Human)
Description:
P43405
Residue:
635
  
Inhibitor
Name:
BDBM473082
Synonyms:
N-[6-(1H-indazol-6- yl)imidazo[1,2- a]pyridin-8-yl]-5- (morpholin-4-yl)pyridin- 2-amine | US10842803, Structure TABLE 1.12
Type:
Small organic molecule
Emp. Form.:
C23H21N7O
Mol. Mass.:
411.4591
SMILES:
C1CN(CCO1)c1ccc(Nc2cc(cn3ccnc23)-c2ccc3cn[nH]c3c2)nc1
: