Target
Tyrosine-protein kinase SYK
Ligand
BDBM473105
Substrate
Meas. Tech.
Biochemical Assay
IC50
10500±n/a nM
Citation
 Blomgren, PACurrie, KSKropf, JELee, SHMitchell, SASchmitt, ACXu, JZhao, Z Imidazopyridines Syk inhibitors US Patent  US10842803 Publication Date 11/24/2020 
Target
Name:
Tyrosine-protein kinase SYK
Synonyms:
KSYK_HUMAN Spleen Tyrosine Kinase Tyrosine-protein kinase SYK (Syk)
Type:
Enzyme
Mol. Mass.:
72079.99
Organism:
Homo sapiens (Human)
Description:
P43405
Residue:
635
  
Inhibitor
Name:
BDBM473105
Synonyms:
1,5-dimethyl-N-(6-{1H- pyrrolo[3,2-b]pyridin-6- yl}imidazo[1,2- a]pyridin-8-yl)-1H- pyrazol-3-amine | US10842803, Structure TABLE 1.35
Type:
Small organic molecule
Emp. Form.:
C19H17N7
Mol. Mass.:
343.3852
SMILES:
Cc1cc(Nc2cc(cn3ccnc23)-c2cnc3cc[nH]c3c2)nn1C
: