Target
Tyrosine-protein kinase SYK
Ligand
BDBM473128
Substrate
Meas. Tech.
Biochemical Assay
IC50
19700±n/a nM
Citation
 Blomgren, PACurrie, KSKropf, JELee, SHMitchell, SASchmitt, ACXu, JZhao, Z Imidazopyridines Syk inhibitors US Patent  US10842803 Publication Date 11/24/2020 
Target
Name:
Tyrosine-protein kinase SYK
Synonyms:
KSYK_HUMAN Spleen Tyrosine Kinase Tyrosine-protein kinase SYK (Syk)
Type:
Enzyme
Mol. Mass.:
72079.99
Organism:
Homo sapiens (Human)
Description:
P43405
Residue:
635
  
Inhibitor
Name:
BDBM473128
Synonyms:
5-(8-(5-(2- hydroxypropan-2-yl)-1- methyl-1H-pyrazol-3- ylamino)imidazo[1,2- a]pyridin-6-yl)-1- methyl-1H- benzo[d]imidazol-2(3H)- one | US10842803, Structure TABLE 1.58
Type:
Small organic molecule
Emp. Form.:
C22H23N7O2
Mol. Mass.:
417.4637
SMILES:
Cn1nc(Nc2cc(cn3ccnc23)-c2ccc3n(C)c(=O)[nH]c3c2)cc1C(C)(C)O
: