Target
Deoxyuridine 5'-triphosphate nucleotidohydrolase, mitochondrial
Ligand
BDBM473981
Substrate
Meas. Tech.
dUTPase Inhibition
IC50
150000±n/a nM
Citation
 Spyvee, M Hydantoin containing deoxyuridine triphosphatase inhibitors US Patent  US10858344 Publication Date 12/8/2020 
Target
Name:
Deoxyuridine 5'-triphosphate nucleotidohydrolase, mitochondrial
Synonyms:
DUT Deoxyuridine 5'-triphosphate nucleotidohydrolase (dUTPase) dUTP pyrophosphatase
Type:
Enzyme
Mol. Mass.:
26574.03
Organism:
Homo sapiens (Human)
Description:
P33316
Residue:
252
  
Inhibitor
Name:
BDBM473981
Synonyms:
US10858344, Example 91
Type:
Small organic molecule
Emp. Form.:
C21H31N3O6S
Mol. Mass.:
453.552
SMILES:
CC[C@@](O)(CNS(=O)(=O)C\C=C\CN1CC(=O)NC1=O)c1cccc(OCC(C)C)c1
: