Target
Dual specificity calcium/calmodulin-dependent 3',5'-cyclic nucleotide phosphodiesterase 1B
Ligand
BDBM474173
Substrate
Meas. Tech.
PDE1 Inhibition Assay
IC50
3.00±n/a nM
Citation
 Kehler, JRasmussen, LKLanggård, MJessing, MJuhl, KVital, PJ Imidazopyrazinones as PDE1 inhibitors US Patent  US10858362 Publication Date 12/8/2020 
Target
Name:
Dual specificity calcium/calmodulin-dependent 3',5'-cyclic nucleotide phosphodiesterase 1B
Synonyms:
63 kDa Cam-PDE Calcium/calmodulin-dependent 3',5'-cyclic nucleotide phosphodiesterase 1B PDE1B PDE1B_HUMAN Phosphodiesterase 1B Phosphodiesterase Type 1 (PDE1B) | Phosphodiesterase, PDE1/PDE5
Type:
Enzyme
Mol. Mass.:
61366.51
Organism:
Homo sapiens (Human)
Description:
Residue:
536
  
Inhibitor
Name:
BDBM474173
Synonyms:
7-(4-methoxybenzyl)-6-methyl-3- (2-methyltetrahydrofuran-3- yl)imidazo[1,5-a]pyrazin-8(7H)- one, stereoisomer 2 US10858362, Example 55, isomer 3 US11472810, Example 55, isomer 2
Type:
Small organic molecule
Emp. Form.:
C20H23N3O3
Mol. Mass.:
353.4149
SMILES:
COc1ccc(Cn2c(C)cn3c(ncc3c2=O)[C@@H]2CCO[C@H]2C)cc1
: