Target
Cyclin-dependent kinase 7
Ligand
BDBM395709
Substrate
Meas. Tech.
Kinase Activity Assay
IC50
550±n/a nM
Citation
 Ciblat, SKabro, ALeblanc, MLeger, SMarineau, JJMiller, TRoy, SSchmidt, DSiddiqui, MASprott, KWinter, DKRipka, ALi, DZhang, G Inhibitors of cyclin-dependent kinase 7 (CDK7) US Patent  US10865206 Publication Date 12/15/2020 
Target
Name:
Cyclin-dependent kinase 7
Synonyms:
39 kDa protein kinase CAK1 CDK-activating kinase 1 (CAK) CDK7_HUMAN Cell division protein kinase 7 Cyclin-dependent kinase 7 (CDK7/cyclin H) P39 Mo15 TFIIH basal transcription factor complex kinase subunit
Type:
Enzyme Subunit
Mol. Mass.:
39047.01
Organism:
Homo sapiens (Human)
Description:
Residue:
346
  
Inhibitor
Name:
BDBM395709
Synonyms:
4-amino-N-(5-(5-chloro-4-(1H-indol-3-yl)pyrimidin-2-ylamino)bicyclo[3.1.1]heptan-1-yl)benzamide US10865206, Compound 104
Type:
Small organic molecule
Emp. Form.:
C26H25ClN6O
Mol. Mass.:
472.969
SMILES:
Nc1ccc(cc1)C(=O)NC12CC(C1)(CCC2)Nc1ncc(Cl)c(n1)-c1c[nH]c2ccccc12
: