Target
Mitogen-activated protein kinase 14
Ligand
BDBM476197
Substrate
Meas. Tech.
Kinase Assay
IC50
2655±466 nM
Citation
 Laco, FLow, JLOh, SChai, CLZhong, Q 2,4,5-tri-substituted azole-based casein kinase 1 inhibitors as inducers for cardiomyogenesis US Patent  US10865384 Publication Date 12/15/2020 
Target
Name:
Mitogen-activated protein kinase 14
Synonyms:
CSAID-binding protein CSBP1 CSPB1 MAP kinase 14 MAP kinase p38 alpha MAPK14 MK14_HUMAN Mitogen-activated protein kinase p38 alpha Stress-activated protein kinase 2a | p38 MAP kinase alpha/beta
Type:
Serine/threonine-protein kinase
Mol. Mass.:
41286.76
Organism:
Homo sapiens (Human)
Description:
Q16539
Residue:
360
  
Inhibitor
Name:
BDBM476197
Synonyms:
US10865384, Compound IM-02 | US10865384, Example 2t
Type:
Small organic molecule
Emp. Form.:
C25H15F4N3
Mol. Mass.:
433.4003
SMILES:
Fc1c(ccc2ccccc12)-c1nc(c([nH]1)-c1ccncc1)-c1cccc(c1)C(F)(F)F
: