Target
Casein kinase I isoform delta
Ligand
BDBM476204
Substrate
Meas. Tech.
LanthaScreen Eu Kinase Binding Assay
IC50
2539±n/a nM
Citation
 Laco, FLow, JLOh, SChai, CLZhong, Q 2,4,5-tri-substituted azole-based casein kinase 1 inhibitors as inducers for cardiomyogenesis US Patent  US10865384 Publication Date 12/15/2020 
Target
Name:
Casein kinase I isoform delta
Synonyms:
CKI-delta CSNK1D Casein kinase I delta Casein kinase I isoform delta (CK1D) KC1D_HUMAN | casein kinases 1 delta (CK1 delta)
Type:
Enzyme
Mol. Mass.:
47356.76
Organism:
Homo sapiens (Human)
Description:
P48730
Residue:
415
  
Inhibitor
Name:
BDBM476204
Synonyms:
US10865384, Compound IM-16 | US10865384, Example 4a
Type:
Small organic molecule
Emp. Form.:
C22H22N2O2S
Mol. Mass.:
378.487
SMILES:
Cc1cccc(c1)-c1nc([nH]c1C1=CCOCC1)-c1ccc(cc1)S(C)=O
: