Target
Sodium-dependent serotonin transporter
Ligand
BDBM476340
Substrate
Meas. Tech.
Radioligand Binding Assays
IC50
34000±n/a nM
Citation
 Sonesson, CPettersson, F Azetidine derivatives useful as modulators of cortical catecholaminergic neurotransmission US Patent  US10875829 Publication Date 12/29/2020 
Target
Name:
Sodium-dependent serotonin transporter
Synonyms:
5-HT Transporter 5HTT SC6A4_HUMAN SLC6A4 Serotonin transporter (5HTT) Sodium-dependent serotonin transporter (SERT) | Solute carrier family 6 member 4
Type:
Multi-pass membrane protein
Mol. Mass.:
70322.51
Organism:
Homo sapiens (Human)
Description:
P31645
Residue:
630
  
Inhibitor
Name:
BDBM476340
Synonyms:
3-(2,3-difluorophenoxy)azetidine | US10875829, Example 1A
Type:
Small organic molecule
Emp. Form.:
C9H9F2NO
Mol. Mass.:
185.1707
SMILES:
Fc1cccc(OC2CNC2)c1F
: