Target
Beta-secretase 1
Ligand
BDBM476684
Substrate
Meas. Tech.
Potency Activity Assay
IC50
>300±n/a nM
Citation
 Cherukury, MLin, HYu, SCPhang, RRajan, YCTang-Liu, DDWhite, ADMalone, TBeresis, R Compounds and their use as BACE1 inhibitors US Patent  US10870635 Publication Date 12/22/2020 
Target
Name:
Beta-secretase 1
Synonyms:
ASP2 Aspartyl protease 2 BACE1 Beta-secretase (BACE) Beta-secretase 1 (BACE 1) Beta-secretase 1 (BACE1) Beta-site amyloid precursor protein cleaving enzyme 1 Memapsin-2 beta-Secretase (BACE-1) | beta-Secretase (BACE1)
Type:
Protein
Mol. Mass.:
55755.10
Organism:
Homo sapiens (Human)
Description:
P56817
Residue:
501
  
Inhibitor
Name:
BDBM476684
Synonyms:
(S)-6-(8-(Diethylamino)dibenzo[b,d] thiophen-2-yl)-2-imino-3,6-dimethyl- tetrahydropyrimidin-4(1H)-one | US10870635, Example 92
Type:
Small organic molecule
Emp. Form.:
C22H26N4OS
Mol. Mass.:
394.533
SMILES:
CCN(CC)c1ccc2sc3ccc(cc3c2c1)[C@]1(C)CC(=O)N(C)C(=N)N1
: