Target
Protein mono-ADP-ribosyltransferase TIPARP
Ligand
BDBM431099
Substrate
Meas. Tech.
Enzymatic Assay
IC50
<100±n/a nM
Citation
 Vasbinder, MMSchenkel, LBSwinger, KKKuntz, KW Pyridazinones as PARP7 inhibitors US Patent  US10870641 Publication Date 12/22/2020 
Target
Name:
Protein mono-ADP-ribosyltransferase TIPARP
Synonyms:
ADP-ribosyltransferase diphtheria toxin-like 14 PARP-7 PARPT_HUMAN TCDD-inducible poly [ADP-ribose] polymerase | TIPARP
Type:
Protein
Mol. Mass.:
76228.44
Organism:
Human
Description:
Q7Z3E1
Residue:
657
  
Inhibitor
Name:
BDBM431099
Synonyms:
6-[4-(4-[[(2S)-1-[6-oxo-5-(trifluoromethyl)-1,6-dihydropyridazin-4-yl]pyrrolidin-2-yl]methoxy]butanoyl)piperazin-1-yl]pyridine-3-carbonitrile US10870641, Example 77 | US11014913, Example 77
Type:
Small organic molecule
Emp. Form.:
C24H28F3N7O3
Mol. Mass.:
519.5194
SMILES:
FC(F)(F)c1c(cn[nH]c1=O)N1CCC[C@H]1COCCCC(=O)N1CCN(CC1)c1ccc(cn1)C#N
: