Target
Protein mono-ADP-ribosyltransferase TIPARP
Ligand
BDBM431804
Substrate
Meas. Tech.
Enzymatic Assay
IC50
<100±n/a nM
Citation
 Vasbinder, MMSchenkel, LBSwinger, KKKuntz, KW Pyridazinones as PARP7 inhibitors US Patent  US10870641 Publication Date 12/22/2020 
Target
Name:
Protein mono-ADP-ribosyltransferase TIPARP
Synonyms:
ADP-ribosyltransferase diphtheria toxin-like 14 PARP-7 PARPT_HUMAN TCDD-inducible poly [ADP-ribose] polymerase | TIPARP
Type:
Protein
Mol. Mass.:
76228.44
Organism:
Human
Description:
Q7Z3E1
Residue:
657
  
Inhibitor
Name:
BDBM431804
Synonyms:
US10550105, Example 670 US11014913, Example 687
Type:
Small organic molecule
Emp. Form.:
C20H26F3N7O3
Mol. Mass.:
469.4607
SMILES:
C[C@@H](COCCC(=O)N1CCN(CC1)c1ncc(C)cn1)Nc1cn[nH]c(=O)c1C(F)(F)F
: