Target
Dihydroorotate dehydrogenase (quinone), mitochondrial
Ligand
BDBM477584
Substrate
Meas. Tech.
Inhibition Assay
IC50
9.00±n/a nM
Citation
 Lain, SDrummond, CLeeuwen, IVHaraldsson, MJohansson, LSandberg, LYngve, U Tetrahydroindazoles and medical uses thereof US Patent  US10889564 Publication Date 1/12/2021 
Target
Name:
Dihydroorotate dehydrogenase (quinone), mitochondrial
Synonyms:
DHODH Dihydroorotate dehydrogenase Dihydroorotate dehydrogenase, mitochondrial Dihydroorotate oxidase (DHODH) | PYRD_HUMAN
Type:
Enzyme
Mol. Mass.:
42881.33
Organism:
Homo sapiens (Human)
Description:
Q02127
Residue:
395
  
Inhibitor
Name:
BDBM477584
Synonyms:
N-[(4R)-1-(2-fluorophenyl)-4,5,6,7-tetrahydro-1H-indazol-4-yl]-4,5,6,7-tetrahydro-2,1-benzoxazole-3-carboxamide | US10889564, Example 14
Type:
Small organic molecule
Emp. Form.:
C21H21FN4O2
Mol. Mass.:
380.4154
SMILES:
Fc1ccccc1-n1ncc2[C@@H](CCCc12)NC(=O)c1onc2CCCCc12
: