Target
Transitional endoplasmic reticulum ATPase
Ligand
BDBM478190
Substrate
Meas. Tech.
Biomol Green Assay
IC50
48.0±n/a nM
Citation
 Huryn, DMWipf, PLaPorte, MG Modulators of P97 AAA ATPase activity US Patent  US10894782 Publication Date 1/19/2021 
Target
Name:
Transitional endoplasmic reticulum ATPase
Synonyms:
TERA_HUMAN VCP Valosin-containing protein
Type:
Enzyme
Mol. Mass.:
89300.63
Organism:
Homo sapiens (Human)
Description:
P55072
Residue:
806
  
Inhibitor
Name:
BDBM478190
Synonyms:
US10894782, No 43 | US10894782, No 46
Type:
Small organic molecule
Emp. Form.:
C28H33N5O3S
Mol. Mass.:
519.658
SMILES:
Cc1cc(OCc2nnc(SC3CCCC3)n2-c2cccnc2)ccc1C#CCNC(=O)OC(C)(C)C
: