Target
Transitional endoplasmic reticulum ATPase
Ligand
BDBM478257
Substrate
Meas. Tech.
Biomol Green Assay
IC50
60.0±n/a nM
Citation
 Huryn, DMWipf, PLaPorte, MG Modulators of P97 AAA ATPase activity US Patent  US10894782 Publication Date 1/19/2021 
Target
Name:
Transitional endoplasmic reticulum ATPase
Synonyms:
TERA_HUMAN VCP Valosin-containing protein
Type:
Enzyme
Mol. Mass.:
89300.63
Organism:
Homo sapiens (Human)
Description:
P55072
Residue:
806
  
Inhibitor
Name:
BDBM478257
Synonyms:
US10894782, No 110
Type:
Small organic molecule
Emp. Form.:
C38H46N6O4S
Mol. Mass.:
682.875
SMILES:
Cc1cc(OCc2nnc(SC3CCCC3)n2-c2cccnc2)ccc1C#CCOC(=O)NCCNC(=O)CC1[C@H]2CC3C[C@@H](C[C@H]1C3)C2
: