Target
Transitional endoplasmic reticulum ATPase
Ligand
BDBM478269
Substrate
Meas. Tech.
Biomol Green Assay
IC50
19.0±n/a nM
Citation
 Huryn, DMWipf, PLaPorte, MG Modulators of P97 AAA ATPase activity US Patent  US10894782 Publication Date 1/19/2021 
Target
Name:
Transitional endoplasmic reticulum ATPase
Synonyms:
TERA_HUMAN VCP Valosin-containing protein
Type:
Enzyme
Mol. Mass.:
89300.63
Organism:
Homo sapiens (Human)
Description:
P55072
Residue:
806
  
Inhibitor
Name:
BDBM478269
Synonyms:
US10894782, No 122
Type:
Small organic molecule
Emp. Form.:
C31H35FN6O4S
Mol. Mass.:
606.711
SMILES:
COc1cc(C#CCOC(=O)NC2CCN(C)CC2)c(F)cc1OCc1nnc(SC2CCCC=C2)n1-c1cccnc1
: