Target
Cyclin-dependent kinase 12
Ligand
BDBM478666
Substrate
Meas. Tech.
Biochemical Assay for CDK12 (IC50 Determination)
IC50
1019±n/a nM
Citation
 Poddutoori, RSamajdar, SMukherjee, S Substituted pyrazole derivatives as selective CDK12/13 inhibitors US Patent  US10894786 Publication Date 1/19/2021 
Target
Name:
Cyclin-dependent kinase 12
Synonyms:
2.7.11.22 CDC2-related protein kinase 7 CDK12_HUMAN CRKRS Cell division cycle 2-related protein kinase 7 Cyclin-dependent kinase 12 hCDK12
Type:
PROTEIN
Mol. Mass.:
164218.64
Organism:
Homo sapiens
Description:
ChEMBL_117739
Residue:
1490
  
Inhibitor
Name:
BDBM478666
Synonyms:
N-(4-(4-(1-((5-cyclopropyl-1H-pyrazol-3-yl)amino)-1-oxopropan-2- yl)phenyl)cyclohexyl)acrylamide | US10894786, Comp. No 11
Type:
Small organic molecule
Emp. Form.:
C24H30N4O2
Mol. Mass.:
406.5206
SMILES:
C[C@H](C(=O)Nc1cc(n[nH]1)C1CC1)c1ccc(cc1)C1CCC(CC1)NC(=O)C=C
: