Target
Cyclin-dependent kinase 7
Ligand
BDBM478931
Substrate
Meas. Tech.
Biochemical Assay for CDK7
IC50
7960±n/a nM
Citation
 Poddutoori, RSamajdar, SMukherjee, S Substituted pyrazole derivatives as selective CDK12/13 inhibitors US Patent  US10894786 Publication Date 1/19/2021 
Target
Name:
Cyclin-dependent kinase 7
Synonyms:
39 kDa protein kinase CAK1 CDK-activating kinase 1 (CAK) CDK7_HUMAN Cell division protein kinase 7 Cyclin-dependent kinase 7 (CDK7/cyclin H) P39 Mo15 TFIIH basal transcription factor complex kinase subunit
Type:
Enzyme Subunit
Mol. Mass.:
39047.01
Organism:
Homo sapiens (Human)
Description:
Residue:
346
  
Inhibitor
Name:
BDBM478931
Synonyms:
2-(4-(4-acryloylpiperazin-1-yl)phenyl)-N-(5-cyclopropyl-1H-pyrazol-3- yl)propanamide | US10894786, Comp. No 17
Type:
Small organic molecule
Emp. Form.:
C22H27N5O2
Mol. Mass.:
393.4821
SMILES:
CC(C(=O)Nc1cc([nH]n1)C1CC1)c1ccc(cc1)N1CCN(CC1)C(=O)C=C
: