Target
Dual specificity calcium/calmodulin-dependent 3',5'-cyclic nucleotide phosphodiesterase 1A
Ligand
BDBM474130
Substrate
Meas. Tech.
Inhibition Assay
IC50
14.0±n/a nM
Citation
 Kehler, JRasmussen, LKLanggård, MJessing, MVital, PJJuhl, K Combinations comprising substituted imidazo[1,5-α]pyrazinones as PDE1 inhibitors US Patent  US10905688 Publication Date 2/2/2021 
Target
Name:
Dual specificity calcium/calmodulin-dependent 3',5'-cyclic nucleotide phosphodiesterase 1A
Synonyms:
61 kDa Cam-PDE Cam-PDE 1A PDE1A_HUMAN | hCam-1
Type:
Protein
Mol. Mass.:
61245.69
Organism:
Homo sapiens (Human)
Description:
P54750
Residue:
535
  
Inhibitor
Name:
BDBM474130
Synonyms:
7-(4-Methoxybenzyl)-6-methyl-3- (tetrahydro-2H-pyran-4- yl)imidazo[1,5-a]pyrazin-8(7H)- one US10912773, Example 23 | US11472810, Example 23
Type:
Small organic molecule
Emp. Form.:
C20H23N3O3
Mol. Mass.:
353.4149
SMILES:
COc1ccc(Cn2c(C)cn3c(ncc3c2=O)C2CCOCC2)cc1
: