Target
Dual specificity calcium/calmodulin-dependent 3',5'-cyclic nucleotide phosphodiesterase 1A
Ligand
BDBM474189
Substrate
Meas. Tech.
Inhibition Assay
IC50
13.0±n/a nM
Citation
 Kehler, JRasmussen, LKLanggård, MJessing, MVital, PJJuhl, K Combinations comprising substituted imidazo[1,5-a]pyrazinones as PDE1 inhibitors US Patent  US10912773 Publication Date 2/9/2021 
Target
Name:
Dual specificity calcium/calmodulin-dependent 3',5'-cyclic nucleotide phosphodiesterase 1A
Synonyms:
61 kDa Cam-PDE Cam-PDE 1A PDE1A_HUMAN | hCam-1
Type:
Protein
Mol. Mass.:
61245.69
Organism:
Homo sapiens (Human)
Description:
P54750
Residue:
535
  
Inhibitor
Name:
BDBM474189
Synonyms:
7-(4-methoxybenzyl)-6-methyl-3- (3-methyltetrahydro-2H-pyran-4- yl)imidazo[1,5-a]pyrazin-8(7H)- one US10912773, Example 69 | US11472810, Example 69
Type:
Small organic molecule
Emp. Form.:
C21H25N3O3
Mol. Mass.:
367.4415
SMILES:
COc1ccc(Cn2c(C)cn3c(ncc3c2=O)C2CCOCC2C)cc1
: