Target
Dual specificity calcium/calmodulin-dependent 3',5'-cyclic nucleotide phosphodiesterase 1B
Ligand
BDBM474194
Substrate
Meas. Tech.
Inhibition Assay
IC50
2.00±n/a nM
Citation
 Kehler, JRasmussen, LKLanggård, MJessing, MVital, PJJuhl, K Combinations comprising substituted imidazo[1,5-a]pyrazinones as PDE1 inhibitors US Patent  US10912773 Publication Date 2/9/2021 
Target
Name:
Dual specificity calcium/calmodulin-dependent 3',5'-cyclic nucleotide phosphodiesterase 1B
Synonyms:
63 kDa Cam-PDE Calcium/calmodulin-dependent 3',5'-cyclic nucleotide phosphodiesterase 1B PDE1B PDE1B_HUMAN Phosphodiesterase 1B Phosphodiesterase Type 1 (PDE1B) | Phosphodiesterase, PDE1/PDE5
Type:
Enzyme
Mol. Mass.:
61366.51
Organism:
Homo sapiens (Human)
Description:
Residue:
536
  
Inhibitor
Name:
BDBM474194
Synonyms:
3-(6-chloro-2,3-dihydro-1H- inden-1-yl)-7-(4-methoxybenzyl)- 6-methylimidazo[1,5-a]pyrazin- 8(7H)-one US10912773, Example 74 | US11472810, Example 74
Type:
Small organic molecule
Emp. Form.:
C24H22ClN3O2
Mol. Mass.:
419.903
SMILES:
COc1ccc(Cn2c(C)cn3c(ncc3c2=O)C2CCc3ccc(Cl)cc23)cc1
: