Target
Fibroblast growth factor receptor 1
Ligand
BDBM249425
Substrate
Meas. Tech.
Inhibition Activity Assay
IC50
105±n/a nM
Citation
 Reynolds, DHao, MWang, JPrajapati, SSatoh, TSelvaraj, A Pyrimidine FGFR4 inhibitors US Patent  US10912774 Publication Date 2/9/2021 
Target
Name:
Fibroblast growth factor receptor 1
Synonyms:
BFGFR Basic fibroblast growth factor receptor 1 (FGFR1) CEK FGFR-1 FGFR-1, (FL) FGFR1_HUMAN FLT2 Fibroblast growth factor receptor 1 (FGFR-1) Fms-like tyrosine kinase 2 N-sam bFGF-R | c-fgr
Type:
Receptor
Mol. Mass.:
91861.70
Organism:
Homo sapiens (Human)
Description:
P11362
Residue:
822
  
Inhibitor
Name:
BDBM249425
Synonyms:
US10537571, Compound 144 US9434697, 144 | US9730931, Compound 144
Type:
Small organic molecule
Emp. Form.:
C29H34ClFN8O4
Mol. Mass.:
613.083
SMILES:
CCN1CCN(CC1)c1ccc(Nc2cc(ncn2)N(C)C(=O)Nc2c(F)c(OC)cc(OC)c2Cl)c(NC(=O)C=C)c1
: