Target
Fibroblast growth factor receptor 1
Ligand
BDBM249435
Substrate
Meas. Tech.
Inhibition Activity Assay
IC50
1950±n/a nM
Citation
 Reynolds, DHao, MWang, JPrajapati, SSatoh, TSelvaraj, A Pyrimidine FGFR4 inhibitors US Patent  US10912774 Publication Date 2/9/2021 
Target
Name:
Fibroblast growth factor receptor 1
Synonyms:
BFGFR Basic fibroblast growth factor receptor 1 (FGFR1) CEK FGFR-1 FGFR-1, (FL) FGFR1_HUMAN FLT2 Fibroblast growth factor receptor 1 (FGFR-1) Fms-like tyrosine kinase 2 N-sam bFGF-R | c-fgr
Type:
Receptor
Mol. Mass.:
91861.70
Organism:
Homo sapiens (Human)
Description:
P11362
Residue:
822
  
Inhibitor
Name:
BDBM249435
Synonyms:
US10537571, Compound 156 US9434697, 156 | US9730931, Compound 156
Type:
Small organic molecule
Emp. Form.:
C25H26Cl2N6O5
Mol. Mass.:
561.417
SMILES:
COc1cc(OC)c(Cl)c(NC(=O)N(C)c2cc(Nc3ccc(cc3NC(=O)C=C)C(C)O)ncn2)c1Cl
: