Target
Ubiquitin carboxyl-terminal hydrolase 28
Ligand
BDBM482031
Substrate
Meas. Tech.
Biochemical Assay
IC50
<200±n/a nM
Citation
 Guerin, DJBair, KWCaravella, JAIoannidis, Jr., SLancia, Jr., DRLi, HMischke, SNg, PYRichard, DSchiller, SEShelekhin, TWang, Z Thienopyridine carboxamides as ubiquitin-specific protease inhibitors US Patent  US10913753 Publication Date 2/9/2021 
Target
Name:
Ubiquitin carboxyl-terminal hydrolase 28
Synonyms:
3.4.19.12 KIAA1515 USP28 Ubiquitin thioesterase 28 | Ubiquitin-specific-processing protease 28
Type:
PROTEIN
Mol. Mass.:
122456.92
Organism:
Homo sapiens
Description:
ChEMBL_105199
Residue:
1077
  
Inhibitor
Name:
BDBM482031
Synonyms:
US10913753, Compound I-98
Type:
Small organic molecule
Emp. Form.:
C24H27F2N5OS
Mol. Mass.:
471.566
SMILES:
C[C@@H](CNC(=O)c1sc2nc(C)ccc2c1N)c1cc(F)c(cc1F)N1CC2CCC(C1)N2
: