Target
Ubiquitin carboxyl-terminal hydrolase 28
Ligand
BDBM482067
Substrate
Meas. Tech.
Biochemical Assay
IC50
<200±n/a nM
Citation
 Guerin, DJBair, KWCaravella, JAIoannidis, Jr., SLancia, Jr., DRLi, HMischke, SNg, PYRichard, DSchiller, SEShelekhin, TWang, Z Thienopyridine carboxamides as ubiquitin-specific protease inhibitors US Patent  US10913753 Publication Date 2/9/2021 
Target
Name:
Ubiquitin carboxyl-terminal hydrolase 28
Synonyms:
3.4.19.12 KIAA1515 USP28 Ubiquitin thioesterase 28 | Ubiquitin-specific-processing protease 28
Type:
PROTEIN
Mol. Mass.:
122456.92
Organism:
Homo sapiens
Description:
ChEMBL_105199
Residue:
1077
  
Inhibitor
Name:
BDBM482067
Synonyms:
US10913753, Compound I-134
Type:
Small organic molecule
Emp. Form.:
C22H27N5OS
Mol. Mass.:
409.548
SMILES:
C[C@@H]1CN(CCN1)c1ccc(CCNC(=O)c2sc3nc(C)ccc3c2N)cc1
: