Target
Eukaryotic translation initiation factor 2-alpha kinase 3
Ligand
BDBM482230
Substrate
Meas. Tech.
Quantification of the Phosphorylated Product Formed from the Kinase Reaction in Presence of ATP
IC50
105±n/a nM
Citation
 Bindi, SCarenzi, DMotto, IPulici, M N-(substituted-phenyl)-sulfonamide derivatives as kinase inhibitors US Patent  US10918642 Publication Date 2/16/2021 
Target
Name:
Eukaryotic translation initiation factor 2-alpha kinase 3
Synonyms:
E2AK3_HUMAN HsPEK PERK Pancreatic endoplasmic reticulum kinase (PERK)
Type:
Enzyme
Mol. Mass.:
125190.66
Organism:
Homo sapiens (Human)
Description:
Q9NZJ5
Residue:
1116
  
Inhibitor
Name:
BDBM482230
Synonyms:
N-[3-(4-Amino-7-methyl-7H-pyrrolo[2,3-d]pyrimidin-5-yl)-2-cyano-phenyl]-5-chloro-2-fluoro-4-methoxy-benzenesulfonamide US11491158, Cmpd 90
Type:
Small organic molecule
Emp. Form.:
C21H16ClFN6O3S
Mol. Mass.:
486.907
SMILES:
COc1cc(F)c(cc1Cl)S(=O)(=O)Nc1cccc(-c2cn(C)c3ncnc(N)c23)c1C#N
: