Target
Cyclin-dependent kinase 2/G1/S-specific cyclin-E1
Ligand
BDBM130909
Substrate
Meas. Tech.
Biological Activity Assay
IC50
3.93±n/a nM
Citation
 Tavares, FXStrum, JC CDK inhibitors US Patent  US10927120 Publication Date 2/23/2021 
Target
Name:
Cyclin-dependent kinase 2/G1/S-specific cyclin-E1
Synonyms:
CDK2/CycE CDK2/E Cyclin-Dependent Kinase 2 (CDK2) Cyclin-dependent kinase 2/cyclin E1
Type:
Protein
Mol. Mass.:
Description:
Components:
This complex has 2 components.
Component 1
Name:
Cyclin-dependent kinase 2
Synonyms:
CDK2 CDK2_HUMAN Cell division protein kinase 2 Protein cereblon/Cyclin-dependent kinase 2 | p33 protein kinase
Type:
Enzyme Subunit
Mol. Mass.:
33938.17
Organism:
Homo sapiens (Human)
Description:
P24941
Residue:
298
  
Component 2
Name:
G1/S-specific cyclin-E1
Synonyms:
CCNE CCNE1_HUMAN
Type:
Enzyme Subunit
Mol. Mass.:
47073.17
Organism:
Homo sapiens (Human)
Description:
Residue:
410
  
Inhibitor
Name:
BDBM130909
Synonyms:
US10683289, Example Staurosporine US8822500, Stauro- sporine | US9920060, Staurosporine
Type:
Small organic molecule
Emp. Form.:
C28H26N4O3
Mol. Mass.:
466.531
SMILES:
CNC1CC2OC(C)(C1OC)n1c3ccccc3c3c4CNC(=O)c4c4c5ccccc5n2c4c13
: