Target
Resistin
Ligand
BDBM486506
Substrate
Meas. Tech.
Evaluation of the Ability to Inhibit TNF-α Secretion by human Resistin
IC50
1900±n/a nM
Citation
 Yoo, JKLee, NLee, CHJung, MKim, H Phenyl phthalazine derivative, method for the preparation thereof, and pharmaceutical composition comprising the same US Patent  US10947241 Publication Date 3/16/2021 
Target
Name:
Resistin
Synonyms:
ADSF C/EBP-epsilon-regulated myeloid-specific secreted cysteine-rich protein Cysteine-rich secreted protein FIZZ3 HXCP1 RETN_HUMAN | RSTN
Type:
Protein
Mol. Mass.:
11419.78
Organism:
Human
Description:
Q9HD89
Residue:
108
  
Inhibitor
Name:
BDBM486506
Synonyms:
US10947241, Example 54
Type:
Small organic molecule
Emp. Form.:
C20H21ClN4
Mol. Mass.:
352.861
SMILES:
CCNC1CCN(C1)c1nnc(-c2ccc(Cl)cc2)c2ccccc12
: