BDBM100234 4-chloranyl-5,6-dimethyl-7-(phenylmethyl)pyrrolo[2,3-d]pyrimidine::4-chloro-5,6-dimethyl-7-(phenylmethyl)pyrrolo[2,3-d]pyrimidine::7-benzyl-4-chloro-5,6-dimethyl-7H-pyrrolo[2,3-d]pyrimidine::7-benzyl-4-chloro-5,6-dimethyl-pyrrolo[2,3-d]pyrimidine::7-benzyl-4-chloro-5,6-dimethylpyrrolo[2,3-d]pyrimidine::MLS001195354::SMR000550587::cid_1475476
SMILES Cc1c(C)c2c(Cl)ncnc2n1Cc1ccccc1
InChI Key InChIKey=OWTBZRBZLBQVFN-UHFFFAOYSA-N
Data  2 IC50
  Tab Delimited (TSV)   2D SDfile   Computed 3D by Vconf -m prep SDfile
Find this compound or compounds like it in BindingDB:
Activity Spreadsheet -- Enzyme Inhibition Constant Data from BindingDB
Found 1 hit for monomerid = 100234
TargetTegument protein VP16(Human herpesvirus 1 (strain 17) (HHV-1) (Human her...)
The Scripps Research Institute Molecular Screening Center
Curated by PubChem BioAssay
LigandPNGBDBM100234(4-chloranyl-5,6-dimethyl-7-(phenylmethyl)pyrrolo[2...)
Affinity DataIC50:  8.54E+4nM. Assay description: Source (MLPCN Center Name): The Scripps Research Institute Molecular Screening Center Affiliation: The Scripps Research Institute, TSRI Assay Provide...
In DepthDetails PCBioAssay