BDBM101538 US8530494, 208::US8530652, 116::US8530652, 65
SMILES CN(C)C[C@@H](NC(=O)N1Cc2c(Nc3ccnc(C)n3)[nH]nc2C1(C)C)c1ccccc1
InChI Key InChIKey=HEYDCDKYVGFDOG-GOSISDBHSA-N
Data  1 KI  1 EC50
  Tab Delimited (TSV)   2D SDfile   Computed 3D by Vconf -m prep SDfile
Find this compound or compounds like it in BindingDB:
Activity Spreadsheet -- Enzyme Inhibition Constant Data from BindingDB
Found 1 hit for monomerid = 101538
TargetSerine/threonine-protein kinase PAK 4(Homo sapiens (Human))
Agouron Pharmaceuticals
US Patent
LigandPNGBDBM101538(US8530494, 208 | US8530652, 116 | US8530652, 65)
Affinity DataKi:  680nM EC50:  67.1nM. Assay description: The enzymatic activity of PAK4 KD was measured by its ability to catalyzed the transfer of a phosphate residue from a nucleoside triphosphate to an a...
In DepthDetails US Patent