BDBM101541 US8530494, 104::US8530652, 120::US8530652, 68
SMILES CN(C)C[C@@H](OC(=O)N1Cc2c(Nc3ncnc4ccsc34)[nH]nc2C1(C)C)c1ccccc1
InChI Key InChIKey=ZQEASDKTOHDZAN-GOSISDBHSA-N
Data  1 KI  1 EC50
  Tab Delimited (TSV)   2D SDfile   Computed 3D by Vconf -m prep SDfile
Find this compound or compounds like it in BindingDB:
Activity Spreadsheet -- Enzyme Inhibition Constant Data from BindingDB
Found 1 hit for monomerid = 101541
TargetSerine/threonine-protein kinase PAK 4(Homo sapiens (Human))
Agouron Pharmaceuticals
US Patent
LigandPNGBDBM101541(US8530494, 104 | US8530652, 120 | US8530652, 68)
Affinity DataKi:  6.70nM EC50:  20nM. Assay description: The enzymatic activity of PAK4 KD was measured by its ability to catalyzed the transfer of a phosphate residue from a nucleoside triphosphate to an a...
In DepthDetails US Patent