BDBM101543 US8530494, 206::US8530652, 122::US8530652, 70
SMILES CN(C)C[C@@H](OC(=O)N1Cc2c(Nc3ccnc(n3)C#N)[nH]nc2C1(C)C)c1ccccc1
InChI Key InChIKey=UQHBHFFBUUMTEZ-QGZVFWFLSA-N
Data  1 KI  1 EC50
  Tab Delimited (TSV)   2D SDfile   Computed 3D by Vconf -m prep SDfile
Find this compound or compounds like it in BindingDB:
Activity Spreadsheet -- Enzyme Inhibition Constant Data from BindingDB
Found 1 hit for monomerid = 101543
TargetSerine/threonine-protein kinase PAK 4(Homo sapiens (Human))
Agouron Pharmaceuticals
US Patent
LigandPNGBDBM101543(US8530494, 206 | US8530652, 122 | US8530652, 70)
Affinity DataKi:  8.80nM EC50:  1.90nM. Assay description: The enzymatic activity of PAK4 KD was measured by its ability to catalyzed the transfer of a phosphate residue from a nucleoside triphosphate to an a...
In DepthDetails US Patent