BDBM10235 13-{[(2,6-dimethylpyridin-4-yl)sulfanyl]methyl}-2-ethyl-7-methyl-2,4,9,15-tetraazatricyclo[9.4.0.0^{3,8}]pentadeca-1(11),3,5,7,12,14-hexaen-10-one::8-heteroarylthiomethyldipyridodiazepinone deriv. 17
SMILES CCN1c2nccc(C)c2NC(=O)c2cc(CSc3cc(C)nc(C)c3)cnc12
InChI Key InChIKey=YZMDGUHXAPIFCJ-UHFFFAOYSA-N
Data  2 IC50
  Tab Delimited (TSV)   2D SDfile   Computed 3D by Vconf -m prep SDfile
Find this compound or compounds like it in BindingDB:
Activity Spreadsheet -- Enzyme Inhibition Constant Data from BindingDB
Found 2 hits for monomerid = 10235
TargetGag-Pol polyprotein [600-1027,K702N,Y780C]/[600-1155,K702N,Y780C](Human immunodeficiency virus type 1)
Boehringer Ingelheim (Canada)
LigandPNGBDBM10235(13-{[(2,6-dimethylpyridin-4-yl)sulfanyl]methyl}-2-...)
Affinity DataIC50:  170nMpH: 7.4 T: 2°C. Assay description: IC50 values for wild-type and mutant RTs were obtained from a scintillation proximity assay using poly rC/biotin-dG15 and 3H-dGTP. Each value represe...
In DepthDetails ArticlePubMed
TargetGag-Pol polyprotein [600-1027,R876K]/[600-1155](Human immunodeficiency virus type 1)
Boehringer Ingelheim (Canada)
LigandPNGBDBM10235(13-{[(2,6-dimethylpyridin-4-yl)sulfanyl]methyl}-2-...)
Affinity DataIC50:  4.20nMpH: 7.4 T: 2°C. Assay description: IC50 values for wild-type and mutant RTs were obtained from a scintillation proximity assay using poly rC/biotin-dG15 and 3H-dGTP. Each value represe...
In DepthDetails ArticlePubMed