BDBM105198 5‐bromo‐3‐hydroxy‐1,2‐dihydropyridin‐2‐one (Compound 2)
SMILES Oc1cc(Br)c[nH]c1=O
InChI Key InChIKey=KXBXUHWCODHRHK-UHFFFAOYSA-N
Data  1 IC50
PDB links: 1 PDB ID matches this monomer.
  Tab Delimited (TSV)   2D SDfile   Computed 3D by Vconf -m prep SDfile
Find this compound or compounds like it in BindingDB:
Activity Spreadsheet -- Enzyme Inhibition Constant Data from BindingDB
Found 1 hit for monomerid = 105198
TargetPolymerase acidic protein [1-204,T86I,G186S](2009 H1N1 Influenza)
Rutgers University
LigandPNGBDBM105198(5‐bromo‐3‐hydroxy‐1,2̴...)
Affinity DataIC50:  1.60E+4nM. Assay description: Cocktails of 4-8 compounds were used for the initial screening with single compound soaks to verify the bound fragment identity and to rule out coope...