BDBM10899 1-N-(4-tert-butylbenzene)benzene-1,4-disulfonamide::4-(4-tert-Butylphenylsulfonamido)benzenesulfonamide::aromatic/heteroaromatic sulfonamide 33
SMILES CC(C)(C)c1ccc(cc1)S(=O)(=O)Nc1ccc(cc1)S(N)(=O)=O
InChI Key InChIKey=YYGQCFRBGJXGDB-UHFFFAOYSA-N
Data  3 KI
  Tab Delimited (TSV)   2D SDfile   Computed 3D by Vconf -m prep SDfile
Find this compound or compounds like it in BindingDB:
Activity Spreadsheet -- Enzyme Inhibition Constant Data from BindingDB
Found 3 hits for monomerid = 10899
TargetCARBONIC ANHYDRASE(Helicobacter pylori J99)
Kochi Medical School
LigandPNGBDBM10899(1-N-(4-tert-butylbenzene)benzene-1,4-disulfonamide...)
Affinity DataKi:  60nM. Assay description: An Applied Photophysics stopped-flow instrument has been used for assaying the CA-catalyzed CO2 hydration activity. Phenol red has been used as indic...
In DepthDetails ArticlePubMed
TargetCarbonic anhydrase 2(Homo sapiens (Human))
Kochi Medical School
LigandPNGBDBM10899(1-N-(4-tert-butylbenzene)benzene-1,4-disulfonamide...)
Affinity DataKi:  119nM. Assay description: An Applied Photophysics stopped-flow instrument has been used for assaying the CA-catalyzed CO2 hydration activity. Phenol red has been used as indic...
In DepthDetails ArticlePubMed
TargetCarbonic anhydrase 1(Homo sapiens (Human))
Kochi Medical School
LigandPNGBDBM10899(1-N-(4-tert-butylbenzene)benzene-1,4-disulfonamide...)
Affinity DataKi:  1.30E+4nM. Assay description: An Applied Photophysics stopped-flow instrument has been used for assaying the CA-catalyzed CO2 hydration activity. Phenol red has been used as indic...
In DepthDetails ArticlePubMed