BDBM113903 (8S)-7-(4-chlorobenzoyl)-3-[3-(3,3-diphenylpropanoylamino)phenyl]-1-oxa-2,7-diazaspiro[4.4]non-2-ene-8-carboxamide::(8S)-7-(4-chlorophenyl)carbonyl-3-[3-(3,3-diphenylpropanoylamino)phenyl]-1-oxa-2,7-diazaspiro[4.4]non-2-ene-8-carboxamide::(8S)-7-[(4-chlorophenyl)-oxomethyl]-3-[3-[(1-oxo-3,3-diphenylpropyl)amino]phenyl]-1-oxa-2,7-diazaspiro[4.4]non-2-ene-8-carboxamide::MLS000562060::SMR000390693::cid_16681904
SMILES NC(=O)[C@@H]1CC2(CN1C(=O)c1ccc(Cl)cc1)CC(=NO2)c1cccc(NC(=O)CC(c2ccccc2)c2ccccc2)c1
InChI Key InChIKey=CQLBORDEKDMTEW-MWGAKABSSA-N
Data  2 IC50
  Tab Delimited (TSV)   2D SDfile   Computed 3D by Vconf -m prep SDfile
Find this compound or compounds like it in BindingDB:
Activity Spreadsheet -- Enzyme Inhibition Constant Data from BindingDB
Found 1 hit for monomerid = 113903
TargetDisintegrin and metalloproteinase domain-containing protein 17(Homo sapiens (Human))
The Scripps Research Institute Molecular Screening Center
Curated by PubChem BioAssay
LigandPNGBDBM113903((8S)-7-(4-chlorobenzoyl)-3-[3-(3,3-diphenylpropano...)
Affinity DataIC50:  6.95E+4nM. Assay description: Source (MLPCN Center Name): The Scripps Research Institute Molecular Screening Center (SRIMSC) Center Affiliation: Torrey Pines Institute for Molecul...
In DepthDetails PCBioAssay