BDBM114686 2-(3-chlorobenzyl)oxyisoindoline-1,3-quinone::2-[(3-chlorobenzyl)oxy]-1H-isoindole-1,3(2H)-dione::2-[(3-chlorophenyl)methoxy]isoindole-1,3-dione::MLS000539593::SMR000125251::cid_1477060
SMILES Clc1cccc(CON2C(=O)c3ccccc3C2=O)c1
InChI Key InChIKey=MESQAGATDOBCOC-UHFFFAOYSA-N
Data  1 IC50
  Tab Delimited (TSV)   2D SDfile   Computed 3D by Vconf -m prep SDfile
Find this compound or compounds like it in BindingDB:
Activity Spreadsheet -- Enzyme Inhibition Constant Data from BindingDB
Found 1 hit for monomerid = 114686
TargetProtein artemis(Homo sapiens (Human))
Burnham Center For Chemical Genomics
Curated by PubChem BioAssay
LigandPNGBDBM114686(2-(3-chlorobenzyl)oxyisoindoline-1,3-quinone | 2-[...)
Affinity DataIC50:  2.09E+3nM. Assay description: Data Source: Sanford-Burnham Center for Chemical Genomics (SBCCG) Source Affiliation: Sanford-Burnham Medical Research Institute (SBMRI, San Diego CA...
In DepthDetails PCBioAssay