BDBM114689 3-(4-methoxyphenyl)-1-phenyl-N-(1,3-thiazol-2-yl)pyrazole-4-carboxamide::3-(4-methoxyphenyl)-1-phenyl-N-(2-thiazolyl)-4-pyrazolecarboxamide::3-(4-methoxyphenyl)-1-phenyl-N-1,3-thiazol-2-yl-1H-pyrazole-4-carboxamide::3-(4-methoxyphenyl)-1-phenyl-N-thiazol-2-yl-pyrazole-4-carboxamide::MLS000534270::SMR000141707::cid_1068314
SMILES COc1ccc(cc1)-c1nn(cc1C(=O)Nc1nccs1)-c1ccccc1
InChI Key InChIKey=PGCVEQGZPHJFSO-UHFFFAOYSA-N
Data  1 IC50
  Tab Delimited (TSV)   2D SDfile   Computed 3D by Vconf -m prep SDfile
Find this compound or compounds like it in BindingDB:
Activity Spreadsheet -- Enzyme Inhibition Constant Data from BindingDB
Found 1 hit for monomerid = 114689
TargetProtein artemis(Homo sapiens (Human))
Burnham Center For Chemical Genomics
Curated by PubChem BioAssay
LigandPNGBDBM114689(3-(4-methoxyphenyl)-1-phenyl-N-(1,3-thiazol-2-yl)p...)
Affinity DataIC50:  9.49E+3nM. Assay description: Data Source: Sanford-Burnham Center for Chemical Genomics (SBCCG) Source Affiliation: Sanford-Burnham Medical Research Institute (SBMRI, San Diego CA...
In DepthDetails PCBioAssay