BDBM114955 2-(2-furanyl)-3-(phenylmethyl)imidazo[2,1-a]isoquinoline::2-(furan-2-yl)-3-(phenylmethyl)imidazo[2,1-a]isoquinoline::3-benzyl-2-(2-furyl)imidaz[2,1-a]isoquinoline::3-benzyl-2-(furan-2-yl)imidazo[2,1-a]isoquinoline::MLS003222295::SMR001906850::cid_51359022
SMILES C(c1c(nc2c3ccccc3ccn12)-c1ccco1)c1ccccc1
InChI Key InChIKey=XEXUOTIREUSVKK-UHFFFAOYSA-N
Data  2 IC50
  Tab Delimited (TSV)   2D SDfile   Computed 3D by Vconf -m prep SDfile
Find this compound or compounds like it in BindingDB:
Activity Spreadsheet -- Enzyme Inhibition Constant Data from BindingDB
Found 1 hit for monomerid = 114955
TargetOxysterols receptor LXR-beta(Homo sapiens (Human))
The Scripps Research Institute Molecular Screening Center
Curated by PubChem BioAssay
LigandPNGBDBM114955(2-(2-furanyl)-3-(phenylmethyl)imidazo[2,1-a]isoqui...)
Affinity DataIC50:  6.75E+4nM. Assay description: Source (MLPCN Center Name): The Scripps Research Institute Molecular Screening Center Affiliation: UT Southwestern Assay Provider: David Mangelsdorf,...
In DepthDetails PCBioAssay