BDBM116220 US8637502, 60
SMILES O=c1[nH]c2ccccc2n([C@H]2C[C@H]3C=C[C@@H](C2)N3C2CCCCC\C=C/2)c1=O
InChI Key InChIKey=IQQOBQHEIOGKDI-IZVKAGQKSA-N
Data  4 KI
  Tab Delimited (TSV)   2D SDfile   Computed 3D by Vconf -m prep SDfile
Find this compound or compounds like it in BindingDB:
Activity Spreadsheet -- Enzyme Inhibition Constant Data from BindingDB
Found 4 hits for monomerid = 116220
TargetNociceptin receptor(Homo sapiens (Human))
Purde Pharma
US Patent
LigandPNGBDBM116220(US8637502, 60)
Affinity DataKi:  5.60nM ΔG°:  -10.5kcal/molepH: 7.4 T: 2°C. Assay description: ORL-1 Receptor Binding Assay Procedures: Membranes from recombinant HEK-293 cells expressing the human opioid receptor-like receptor (ORL-1) (Recepto...
In DepthDetails US Patent
TargetKappa-type opioid receptor(Homo sapiens (Human))
Purde Pharma
US Patent
LigandPNGBDBM116220(US8637502, 60)
Affinity DataKi:  119nM ΔG°:  -8.77kcal/molepH: 7.4 T: 2°C. Assay description: κ-Opioid Receptor Binding Assay Procedures: Membranes from recombinant HEK-293 cells expressing the human kappa opioid receptor (kappa) (cloned ...
In DepthDetails US Patent
TargetMu-type opioid receptor(Homo sapiens (Human))
Purde Pharma
US Patent
LigandPNGBDBM116220(US8637502, 60)
Affinity DataKi:  1.38E+3nM ΔG°:  -7.99kcal/molepH: 7.4 T: 2°C. Assay description: μ-Opioid Receptor Binding Assay Procedures: Radioligand dose-displacement binding assays for μ-opioid receptors used 0.2 nM[3H]-diprenorphi...
In DepthDetails US Patent
TargetDelta-type opioid receptor(Homo sapiens (Human))
Purde Pharma
US Patent
LigandPNGBDBM116220(US8637502, 60)
Affinity DataKi:  2.34E+4nM ΔG°:  -6.31kcal/molepH: 7.4 T: 2°C. Assay description: δ-Receptor Binding Assay Procedures: Radioligand dose-displacement assays used 0.2 nM [3H]-Naltrindole (NEN; 33.0 Ci/mmole) with 10-20 μg m...
In DepthDetails US Patent