BDBM123068 US10213421, Example 1::US11612596, Example 1.::US8742115, 7
SMILES CNC(=O)c1cc(C)nc(NC(=O)[C@H]2CCC(=O)N2C2CCN(Cc3ccc(Cl)c(C)c3)CC2)c1
InChI Key InChIKey=DRTNQHBPTOBJJH-JOCHJYFZSA-N
Data  3 KI
  Tab Delimited (TSV)   2D SDfile   Computed 3D by Vconf -m prep SDfile
Find this compound or compounds like it in BindingDB:
Activity Spreadsheet -- Enzyme Inhibition Constant Data from BindingDB
Found 3 hits for monomerid = 123068
TargetC-C chemokine receptor type 3(Homo sapiens (Human))
Boehringer Ingelheim International
US Patent
LigandPNGBDBM123068(US10213421, Example 1 | US11612596, Example 1. | U...)
Affinity DataKi:  10.4nM. Assay description: The CCR3 receptor binding assay was performed in a Scintillation Proximity Assay (SPA) design with the radioligand recombinant human 125Iodine-eotaxi...
In DepthDetails US Patent
TargetC-C chemokine receptor type 3(Homo sapiens (Human))
Boehringer Ingelheim International
US Patent
LigandPNGBDBM123068(US10213421, Example 1 | US11612596, Example 1. | U...)
Affinity DataKi:  10.4nM. Assay description: The CCR3 receptor binding assay was performed in a Scintillation Proximity Assay (SPA) design with the radioligand recombinant human 125lodine-eotaxi...
In DepthDetails US Patent
TargetC-C chemokine receptor type 3(Homo sapiens (Human))
Boehringer Ingelheim International
US Patent
LigandPNGBDBM123068(US10213421, Example 1 | US11612596, Example 1. | U...)
Affinity DataKi:  10.4nM. Assay description: Assay is described in WO 2010 115836.
In DepthDetails US Patent